{"text_format":"1","workbook":"xlsx","n_sheets":14,"sheets":["Cover","Reference price essentials","Further resources","General data","Data entry (1)","Data entry (2)","Data entry (3)","Results (1)","Results (2)","Results (3)","hide_backend","hide_LW & Income Database","hide_FLIRP","hide_Suchtabellen"],"not_rendered":{"charts":5,"images":32,"macros":1,"external_links":0,"defined_names":11,"comments":4,"pivot_tables":0},"unopened":[],"bounds":{"document_bytes":16777216,"sheet_cells":100000,"rows_first":2000,"rows_last":500,"rows_between":2000,"halvings":0,"cell_chars":16384,"cell_head_chars":4096},"cells_cut":0,"cells_raw":0,"read":"whole","date_system":"1900"}

{"sheet":"Cover","index":0,"n_rows":36,"n_cols":9,"rows_kept":36,"cut":false,"hidden":false,"merged":[[2,3,2,12],[3,3,3,12],[19,5,20,11],[21,5,22,11],[30,5,30,11],[18,5,18,11],[37,7,37,8],[28,5,28,11],[35,8,35,9],[29,5,29,11],[32,5,32,11],[31,5,31,10]]}
[]
[]
[null,null,null,"GIZ (Living Income) Reference Price Estimator"]
[null,null,null,"v1.0 (01.02.2022)"]
[]
[]
[null,null,"About this tool",null,"This tool allows calculating (Living Income) Reference Prices using available gross margin data"]
[null,null,null,null,"Two calculation methods are considered in this version (see 'reference price essentials')"]
{"$rows_left_out":29}
{"sheet":"Reference price essentials","index":1,"n_rows":75,"n_cols":8,"rows_kept":75,"cut":false,"hidden":false,"merged":[[43,2,43,11],[67,2,69,11],[10,2,13,11],[15,2,17,11],[19,2,21,11],[23,2,24,11],[45,2,49,11]]}
[]
[]
[null,null,"Essentials of the practitioner guide"]
[null,null,"How to calculate (living income) reference prices for agricultural commodities"]
[null,null,"Loos, Krain, Veldhuyzen van Zanten and Petri (2021, under review) / LICOP"]
[]
[]
[null,null,"This sheet provides the essential information of the practitioner guide on \"How to calculate (living income) "]
{"$rows_left_out":68}
{"sheet":"Further resources","index":2,"n_rows":51,"n_cols":4,"rows_kept":51,"cut":false,"hidden":false,"merged":[[33,2,34,11],[36,2,37,11],[25,2,26,11],[29,2,31,11],[19,2,19,11]]}
[]
[]
[null,null,"Further resources"]
[]
[]
[null,null,"Websites "]
[null,null,"For link, click on image"]
[]
{"$rows_left_out":44}
{"sheet":"General data","index":3,"n_rows":33,"n_cols":15,"rows_kept":33,"cut":false,"hidden":false,"merged":[[20,8,20,9],[19,8,19,9],[12,8,12,9],[9,8,9,9],[10,8,10,9],[11,8,11,9],[14,8,15,9]]}
[]
[null,null,null,null,null,null,null,null,null,null,null,null,null,null,"Kommentare"]
[null,null,"General information and database specification",null,null,null,null,null,null,null,null,null,null,null,"Ab hier wird später gelöscht"]
[]
[]
[null,null,"Q1","Please provide information on the following key aspects"]
[null,null,null,"A set of benchmarks will be generated based on your selection."]
[null,null,null,"Source of benchmarks: https://align-tool.com/"]
{"$rows_left_out":26}
{"sheet":"Data entry (1)","index":4,"n_rows":73,"n_cols":21,"rows_kept":73,"cut":false,"hidden":false,"merged":[[19,2,30,2],[27,11,28,14],[24,4,28,9],[10,13,10,14],[11,13,11,14],[7,2,12,2],[7,13,7,14],[8,13,8,14],[9,13,9,14],[23,4,23,9],[13,13,13,14],[54,13,54,14],[34,2,44,2],[42,11,43,14],[53,2,57,2],[53,13,53,14],[39,4,43,9],[38,4,38,10],[66,2,72,2],[66,13,66,14],[67,13,67,14],[70,13,70,14],[71,13,71,14],[70,4,70,12],[71,4,71,12],[68,13,68,14],[69,13,69,14]]}
[]
[null,null,null,null,null,null,null,null,null,null,null,null,null,null,null,null,null,null,null,null,"delete from P to end"]
[null,null,"Data entry form"]
[null,null,"Information for one (1) production system"]
[]
[]
[null,null,"Q1","Please specify the following general information"]
[null,null,"general information",null,null,null,null,null,null,null,null,null,null,"Unit",null,null,"System 1"]
{"$rows_left_out":66}
{"sheet":"Data entry (2)","index":5,"n_rows":73,"n_cols":25,"rows_kept":73,"cut":false,"hidden":true,"merged":[[27,11,28,14],[24,4,28,9],[39,4,43,9],[38,4,38,10],[7,2,12,2],[7,13,7,14],[8,13,8,14],[9,13,9,14],[10,13,10,14],[11,13,11,14],[13,13,13,14],[34,2,44,2],[42,11,43,14],[19,2,30,2],[66,2,72,2],[66,13,66,14],[67,13,67,14],[70,13,70,14],[54,13,54,14],[68,13,68,14],[71,13,71,14],[69,13,69,14],[70,4,70,12],[71,4,71,12],[53,2,57,2],[53,13,53,14]]}
[]
[null,null,null,null,null,null,null,null,null,null,null,null,null,null,null,null,null,null,null,null,null,null,null,null,"delete from here to end"]
[null,null,"Data entry form"]
[null,null,"Information for two (2) production systems"]
[]
[]
[null,null,"Q1","Please specify the following general information"]
[null,null,"general information",null,null,null,null,null,null,null,null,null,null,"Unit",null,null,"System 1",null,null,null,"System 2"]
{"$rows_left_out":66}
{"sheet":"Data entry (3)","index":6,"n_rows":73,"n_cols":29,"rows_kept":73,"cut":false,"hidden":true,"merged":[[7,2,12,2],[53,2,57,2],[66,2,72,2],[19,2,30,2],[34,2,44,2],[23,16,23,17],[7,13,7,14],[8,13,8,14],[9,13,9,14],[10,13,10,14],[11,13,11,14],[13,13,13,14],[24,4,29,9],[38,4,38,10],[39,4,44,9],[53,13,53,14],[54,13,54,14],[27,11,28,14],[71,13,71,14],[70,4,70,12],[71,4,71,12],[42,11,43,14],[66,13,66,14],[67,13,67,14],[68,13,68,14],[69,13,69,14],[70,13,70,14]]}
[]
[null,null,null,null,null,null,null,null,null,null,null,null,null,null,null,null,null,null,null,null,null,null,null,null,null,null,null,null,"delete from P to end"]
[null,null,"Data entry form"]
[null,null,"Information for three (3) production systems"]
[]
[]
[null,null,"Q1","Please specify the following general information"]
[null,null,"general information",null,null,null,null,null,null,null,null,null,null,"Unit",null,null,"System 1",null,null,null,"System 2",null,null,null,"System 3"]
{"$rows_left_out":66}
{"sheet":"Results (1)","index":7,"n_rows":66,"n_cols":15,"rows_kept":66,"cut":false,"hidden":true,"merged":[[65,1,72,12],[5,9,5,10],[6,9,6,11],[2,1,2,12],[4,9,4,11],[28,1,31,12],[8,9,8,10],[11,9,11,10],[14,9,14,10],[17,9,17,10],[20,9,20,10],[23,9,23,10]]}
[]
[]
[null,"Reference Price to [Benchmark/ poverty line]"]
[]
[null,null,"Reference price in order to achieve:","Method 1\nIncome Share",null,"Method 2\nLabor Share",null,"Unit",null,"Benchmark per HH per year *"]
[null,null,null,null,null,null,null,null,null,"Household with a laborforce of",null,{"$f":"'Data entry (1)'!Q12","v":0}]
[null,null,"Current Price",{"$f":"'Data entry (1)'!$Q$57","v":0},null,{"$f":"'Data entry (1)'!$Q$57","v":0},null,{"$f":"'General data'!$I$13&\" /kg\"","v":"EUR /kg"}]
[]
{"$rows_left_out":59}
{"sheet":"Results (2)","index":8,"n_rows":54,"n_cols":13,"rows_kept":54,"cut":false,"hidden":true,"merged":[[34,10,34,11],[1,2,1,13],[3,10,3,12],[4,10,4,11],[5,10,5,12],[7,10,7,11],[10,10,10,11],[13,10,13,11],[16,10,16,11],[19,10,19,11],[22,10,22,11],[53,1,55,23],[50,1,51,12],[50,13,51,13],[43,10,43,11],[46,10,46,11],[37,10,37,11],[1,1,24,1],[26,1,48,1],[40,10,40,11],[27,10,27,12],[28,10,28,11],[29,10,29,12],[31,10,31,11]]}
[]
[null,"Method 1: Income Share","Reference Price to [Benchmark/poverty line]"]
[]
[null,null,null,"Reference price in order to achieve:",{"$f":"'Data entry (2)'!$Q$9","v":"Name of prod. System 1"},null,{"$f":"'Data entry (2)'!$U$9","v":"Name of prod. System 2"},null,"Unit",null,"Benchmark per HH per year *"]
[null,null,null,null,null,null,null,null,null,null,"Household with a laborforce of",null,{"$f":"'Data entry (2)'!Q12","v":0}]
[null,null,null,"Current Price",{"$f":"'Data entry (2)'!$Q$57","v":0},null,{"$f":"'Data entry (2)'!$U$57","v":0},null,{"$f":"'General data'!$I$13&\" /kg\"","v":"EUR /kg"}]
[]
[null,null,null,"World Bank Poverty Line",{"$f":"IFERROR(hide_backend!$H$18,\"n.a.\")","v":"n.a."},null,{"$f":"IFERROR(hide_backend!$H$27,\"n.a.\")","v":"n.a."},null,{"$f":"'General data'!$I$13&\" /kg\"","v":"EUR /kg"},null,{"$f":"IFERROR(hide_backend!$L$18,\"n.a.\")","v":"n.a."},null,{"$f":"'General data'!$I$13&\" /HH /y\"","v":"EUR /HH /y"}]
{"$rows_left_out":47}
{"sheet":"Results (3)","index":9,"n_rows":53,"n_cols":15,"rows_kept":53,"cut":false,"hidden":true,"merged":[[4,12,4,13],[19,12,19,13],[5,12,5,14],[7,12,7,13],[10,12,10,13],[13,12,13,13],[16,12,16,13],[52,1,54,25],[46,12,46,13],[50,1,50,15],[22,12,22,13],[26,1,48,1],[27,12,27,14],[28,12,28,13],[29,12,29,14],[31,12,31,13],[34,12,34,13],[37,12,37,13],[40,12,40,13],[43,12,43,13],[1,1,24,1],[1,2,1,15],[3,12,3,14]]}
[]
[null,"Method 1: Income Share","Reference Price to [Benchmark/poverty line]"]
[]
[null,null,null,"Reference price in order to achieve:",{"$f":"'Data entry (3)'!Q9","v":"Name of prod. System 1"},null,{"$f":"'Data entry (3)'!U9","v":"Name of prod. System 2"},null,{"$f":"'Data entry (3)'!Y9","v":"Name of prod. System 3"},null,"Unit",null,"Benchmark per HH per year *"]
[null,null,null,null,null,null,null,null,null,null,null,null,"Household with a laborforce of",null,{"$f":"'Data entry (3)'!Q12","v":0}]
[null,null,null,"Current Price",{"$f":"hide_backend!G39","v":0},null,{"$f":"hide_backend!G48","v":0},null,{"$f":"hide_backend!G57","v":0},null,{"$f":"'General data'!$I$13&\" /kg\"","v":"EUR /kg"}]
[]
[null,null,null,"World Bank Poverty Line",{"$f":"IFERROR(hide_backend!$H$39,\"n.a.\")","v":"n.a."},null,{"$f":"IFERROR(hide_backend!$H$48,\"n.a.\")","v":"n.a."},null,{"$f":"IFERROR(hide_backend!$H$57,\"n.a.\")","v":"n.a."},null,{"$f":"'General data'!$I$13&\" /kg\"","v":"EUR /kg"},null,{"$f":"IFERROR(hide_backend!L39,\"n.a.\")","v":"n.a."},null,{"$f":"'General data'!$I$13&\" /HH /y\"","v":"EUR /HH /y"}]
{"$rows_left_out":46}
{"sheet":"hide_backend","index":10,"n_rows":62,"n_cols":14,"rows_kept":62,"cut":false,"hidden":true,"merged":[[1,2,1,11],[2,5,2,9],[2,10,2,11],[3,6,3,7],[3,8,3,9],[4,3,4,4],[15,2,21,2],[15,7,15,8],[15,9,15,10],[15,11,15,12],[16,4,16,5],[14,3,14,12],[24,2,30,2],[24,7,24,8],[24,9,24,10],[24,11,24,12],[25,4,25,5],[35,3,35,13],[36,2,42,2],[36,7,36,8],[36,9,36,10],[36,11,36,12],[37,4,37,5],[45,2,51,2],[45,7,45,8],[45,9,45,10],[45,11,45,12],[46,4,46,5],[54,2,60,2],[54,7,54,8],[54,9,54,10],[54,11,54,12],[55,4,55,5]]}
[null,"Results 1"]
[null,null,"Results "]
[null,null,null,null,null,{"$f":"'Data entry (1)'!Q9","v":"Name of prod. System 1"},null,null,null,null,"Benchmark"]
[null,null,null,null,null,null,"Method 1 \nincome share",null,"Method 2\nlabor share",null,null,null,"Av. Household size"]
[null,null,"Reference price for","Unit",null,"Current price","Reference Price","%-difference","Reference Price","%-difference","Household with a  laborforce of",{"$f":"'Data entry (1)'!Q12","v":0},{"$f":"'Data entry (1)'!Q10","v":0}]
[null,null,"World Bank Poverty Line",{"$f":"'General data'!$I$13:$J$13","v":"EUR"},"/ kg",{"$f":"'Data entry (1)'!$Q$57","v":0},{"$f":"((K6/'Data entry (1)'!Q14*'Data entry (1)'!Q27/100)+('Data entry (1)'!Q73))/'Data entry (1)'!Q56","v":{"$error":"#N/A"}},{"$f":"G6/F6-1","v":{"$error":"#N/A"}},{"$f":"((K6*'Data entry (1)'!Q42/('Data entry (1)'!Q12*'Data entry (1)'!Q13))+'Data entry (1)'!Q73)/'Data entry (1)'!Q56","v":{"$error":"#N/A"}},{"$f":"I6/F6-1","v":{"$error":"#N/A"}},{"$f":"IF(INDEX('hide_LW & Income Database'!L7:N62,MATCH('General data'!I10:J10&'General data'!I11:J11,'hide_LW & Income Database'!A7:A63&'hide_LW & Income Database'!BV7:BV62,0),MATCH('General data'!I13:J13,'hide_LW & Income Database'!P6:R6,0))*12*M5=0, \"Benchmark not available\",INDEX('hide_LW & Income Database'!L7:N62,MATCH('General data'!I10:J10&'General data'!I11:J11,'hide_LW & Income Database'!A7:A63&'hide_LW & Income Database'!BV7:BV62,0),MATCH('General data'!I13:J13,'hide_LW & Income Database'!P6:R6,0))*12*M5)","v":{"$error":"#N/A"}},{"$error":"#N/A"},null,"Originalzahlen gecheckt: Int. Pov line per person per month * 12 * av. Size of household"]
[null,null,"National Poverty Line",{"$f":"'General data'!$I$13:$J$13","v":"EUR"},"/ kg",{"$f":"'Data entry (1)'!$Q$57","v":0},{"$f":"((K7/'Data entry (1)'!Q14*'Data entry (1)'!Q27/100)+('Data entry (1)'!Q73))/'Data entry (1)'!Q56","v":{"$error":"#N/A"}},{"$f":"G7/F7-1","v":{"$error":"#N/A"}},{"$f":"((K7*'Data entry (1)'!Q42/('Data entry (1)'!Q12*'Data entry (1)'!Q13))+'Data entry (1)'!Q73)/'Data entry (1)'!Q56","v":{"$error":"#N/A"}},{"$f":"I7/F7-1","v":{"$error":"#N/A"}},{"$f":"IF(INDEX('hide_LW & Income Database'!AB7:AD62,MATCH('General data'!I10:J10&'General data'!I11:J11,'hide_LW & Income Database'!A7:A63&'hide_LW & Income Database'!BV7:BV62,0),MATCH('General data'!I13:J13,'hide_LW & Income Database'!AB6:AD6,0))*M5*12=0,\"Benchmark not available\",INDEX('hide_LW & Income Database'!AB7:AD62,MATCH('General data'!I10:J10&'General data'!I11:J11,'hide_LW & Income Database'!A7:A63&'hide_LW & Income Database'!BV7:BV62,0),MATCH('General data'!I13:J13,'hide_LW & Income Database'!AB6:AD6,0))*M5*12)","v":{"$error":"#N/A"}},{"$error":"#N/A"},null,"Originalzahlen gecheckt: Nat. Pov line per month * 12 * av. Size of household"]
[null,null,"National Minimum Wage",{"$f":"'General data'!$I$13:$J$13","v":"EUR"},"/ kg",{"$f":"'Data entry (1)'!$Q$57","v":0},{"$f":"((K8/'Data entry (1)'!Q14*'Data entry (1)'!Q27/100)+('Data entry (1)'!Q73))/'Data entry (1)'!Q56","v":{"$error":"#N/A"}},{"$error":"#N/A"},{"$f":"((K8*'Data entry (1)'!Q42/('Data entry (1)'!Q12*'Data entry (1)'!Q13))+'Data entry (1)'!Q73)/'Data entry (1)'!Q56","v":{"$error":"#N/A"}},{"$error":"#N/A"},{"$f":"IF(INDEX('hide_LW & Income Database'!AQ7:AS62,MATCH('General data'!I10:J10&'General data'!I11:J11,'hide_LW & Income Database'!A7:A63&'hide_LW & Income Database'!BV7:BV62,0),MATCH('General data'!I13:J13,'hide_LW & Income Database'!AQ6:AS6,0))*L5*12=0, \"Benchmark not available\", INDEX('hide_LW & Income Database'!AQ7:AS62,MATCH('General data'!I10:J10&'General data'!I11:J11,'hide_LW & Income Database'!A7:A63&'hide_LW & Income Database'!BV7:BV62,0),MATCH('General data'!I13:J13,'hide_LW & Income Database'!AQ6:AS6,0))*L5*12)","v":{"$error":"#N/A"}},{"$error":"#N/A"},null,"Originalzahlen gecheckt: Min. Wage per Workforce per month* 12 * av. Laborforce"]
{"$rows_left_out":55}
{"sheet":"hide_LW & Income Database","index":11,"n_rows":66,"n_cols":74,"rows_kept":66,"cut":false,"hidden":true,"merged":[[4,70,5,70],[4,0,5,0],[4,1,5,1],[4,2,5,2],[4,23,4,25],[4,27,4,30],[4,11,4,14],[4,15,4,18],[4,19,4,22],[2,60,2,69],[2,70,2,72],[2,0,2,2],[2,3,2,7],[2,8,2,22],[2,23,2,38],[2,39,2,49],[2,50,2,59],[3,50,3,59],[3,60,3,69],[3,70,3,72],[4,31,4,34],[4,35,4,38],[4,39,4,41],[4,42,4,45],[4,46,4,49],[4,50,4,51],[4,52,4,55],[4,56,4,59],[4,60,4,61],[4,62,4,65],[4,66,4,69],[4,71,5,71],[4,72,5,72],[0,0,0,2],[1,0,1,2],[3,0,3,2],[3,3,3,7],[3,39,3,49],[0,3,1,7],[3,8,3,22],[3,23,3,38]]}
["Living Wage & Living Income Dataset",null,null,"ALIGN (www.align-tool.com) provides an overview of the available living wage and income studies based on the internationally acknowledged Anker methodology."]
["Data valid on April/ September 2021"]
["Geography\nSource: GLWC & LICoP",null,null,"Family composition\nSource: GLWC & LICoP",null,null,null,null,"International Poverty Lines\nSource: World Bank",null,null,null,null,null,null,null,null,null,null,null,null,null,null,"National Poverty Lines",null,null,null,null,null,null,null,null,null,null,null,null,null,null,null,"Minimum Wages\nSource: ILO & WageIndicator Foundation",null,null,null,null,null,null,null,null,null,null,"(Gross) Living Wages \nSource: Global Living Wage Coalition",null,null,null,null,null,null,null,null,null,"(Net) Living Income\nSource: GLWC & LICoP",null,null,null,null,null,null,null,null,null,"Currency "]
["LW / LI are based on the cost of living in a specific geography, at country or sub-country level, and differ per rural, urban or peri-urban areas",null,null,"The family composition parameters, such as family size, adults per family and labour force are taken from the LW/LI studies.",null,null,null,null,"The International Poverty Lines are retrieved from the World Bank and differ per country according to the World Bank classification by income group. They are based on a division into 4 income groupings: low-income Int. Poverty Line, set at $1.90/day; lower-middle income Int. Poverty Line, set at $3.20/day; upper-middle income Int. Poverty Line, set at $5.50/day; and high-income Int. Poverty Line, set at $21.70/day using 2011 prices. Information on family size and labour force from the LW/LI studies was taken into account.",null,null,null,null,null,null,null,null,null,null,null,null,null,null,"The National Poverty Lines are retrieved from official governmental sources that differ per country and substituted by World Bank data. WB Data is given as 2011  PPP and multiplied with the 2011  PPP Conversion rate to equal LCU per person/day. The information on family size and labour force from the LW/LI studies was taken into account.",null,null,null,null,null,null,null,null,null,null,null,null,null,null,null,"The data refer to national minimum wage rates where they exist. For countries with multiple minimum wage rates, the selected rate has been specified. Data reported as hourly, weekly, and yearly are converted to monthly, using a 45-hour standard work week, with a maximum of 8 hours per day. The information on family size and labour force from the LW/LI studies was taken into account.",null,null,null,null,null,null,null,null,null,null,"The information is from the Global Living Wage Coalition, from living wage studies that use the full Anker Methodology and Anker Reference Values. The Global Living Wage Coalition's data on family size and labour force were taken into account.",null,null,null,null,null,null,null,null,null,"Information from LW/LI studies that use the full Anker Methodology and Anker Reference Values. In the lack of a living income study, cost of living data was taken from living wage studies to provide living income estimates. The information on family size and labour force from the LW/LI studies was taken into account.",null,null,null,null,null,null,null,null,null,"Currency conversion rates to LCU, EUR & USD are from InforEuro, January 2021. International dollars were calculated using the World Bank PPP conversion factor for 2019."]
["Country","Locality","Region/area","Study type","Year \n(of study)","Family size","Adults per family","Labour force","Year","Poverty headcount ratio","Int. poverty line\nPer person/day","Int. poverty line\nPer person/month",null,null,null,"Int. poverty line\nPer workforce/month",null,null,null,"Int. poverty line \nPer family/month",null,null,null,null,null,null,"National poverty line\nPer person/day ","National poverty line\nPer person/month",null,null,null,"National poverty line\nPer workforce/month",null,null,null,"National poverty line\nPer family/month",null,null,null,null,null,null,"Minimum Wage \nPer workforce/month",null,null,null,"Minimum Wage\nPer family/month",null,null,null,null,null,"Living Wage \nPer workforce/month",null,null,null,"Living Wage\nPer family/month",null,null,null,null,null,"Living Income\nPer person/month",null,null,null,"Living Income\nPer family/month",null,null,null,"Local currency unit (LCU)","Currency code","2019 PPP Conversion factor","Needed for Dropdown Menue"]
[null,null,null,null,null,"#people","#adults","Workforce/ family",null,"% of population","USD","USD","EUR","LCU","2019 PPP$","USD","EUR","LCU","2019 PPP$","USD","EUR","LCU","2019 PPP$","Year of study","To add","Source","LCU","LCU","USD","EUR","2019 PPP$","LCU","USD","EUR","2019 PPP$","LCU","USD","EUR","2019 PPP$","Year","Type","Source","LCU","USD","EUR","2019 PPP$","LCU","USD","EUR","2019 PPP$","Year","Source","LCU","USD","EUR","2019 PPP$","LCU","USD","EUR","2019 PPP$","Year","Source","LCU","USD","EUR","2019 PPP$","LCU","USD","EUR","2019 PPP$"]
["Argentina","Non-Metropolitan Urban",null,"Living Wage Reference Value",2020,4,2,1.66,2020,14,5.5,167.2,146.38466957639076,11810.172,{"$error":"#REF!"},402.89156626506025,352.73414355756813,28458.245783132534,{"$error":"#REF!"},668.8,585.53867830556305,47240.688000000002,{"$error":"#REF!"},null,null,null,null,null,null,null,null,null,null,null,null,null,null,null,null,2021,"not applicable","Wage Indicator",21600,227.13411428210898,192.1554606826642,{"$error":"#REF!"},35856,377.04262970830086,318.97806473322254,{"$error":"#REF!"},2020,"GLWC",38741,548.46747363205202,480.18678170469946,{"$error":"#REF!"},64310.06,910.45600622920631,797.11005762980108,{"$error":"#REF!"},2020,"Calculated from GLWC \n(Net LW * labour force)/ family size",15096.039999999999,213.7189778438451,187.1123322600194,{"$error":"#REF!"},60384.159999999996,854.87591137538038,748.4493290400776,{"$error":"#REF!"},"Argentine peso","ARS",{"$error":"#REF!"},"Urban"]
["Argentina","Rural",null,"Living Income Reference Value",2020,4,2,1.66,2020,14,5.5,167.2,146.38466957639076,11810.172,{"$error":"#REF!"},402.89156626506025,352.73414355756813,28458.245783132534,{"$error":"#REF!"},668.8,585.53867830556305,47240.688000000002,{"$error":"#REF!"},null,null,null,null,null,null,null,null,null,null,null,null,null,null,null,null,2021,null,"Wage Indicator",21600,227.13411428210898,192.1554606826642,{"$error":"#REF!"},35856,377.04262970830086,318.97806473322254,{"$error":"#REF!"},null,null,null,{"$error":"#N/A"},{"$error":"#N/A"},{"$error":"#REF!"},0,{"$error":"#N/A"},{"$error":"#N/A"},{"$error":"#REF!"},2020,"GLWC",12505.75,177.04749769944078,155.00621680657562,{"$error":"#REF!"},50023,708.18999079776313,620.02486722630249,{"$error":"#REF!"},"Argentine peso","ARS",{"$error":"#REF!"},"Rural"]
{"$rows_left_out":59}
{"sheet":"hide_FLIRP","index":12,"n_rows":8,"n_cols":6,"rows_kept":8,"cut":false,"hidden":true,"merged":[]}
[null,"Commodity","Country","Fairtrade Living Income Reference Price per Kilo (USD)","Source","Text Ausgabe"]
[null,"Cocao","Cote d'Ivoire","2,2 USD","Link to study"," Cocao: 2.2 USD/kg"]
[null,"Cocao","Ghana","2,1 USD","https://files.fairtrade.net/2019_RevisedExplanatoryNote_FairtradeLivingIncomeReferencePriceCocoa.pdf","Cocoa: 2.1 USD/kg"]
[null,"Coffee","Colombia","in progress (Fairtrade minimum price = 2.8 USD)","https://www.fairtrade.at/fileadmin/AT/News/Aktuelles/Living_Income_Progress_Report_en.pdf","Coffee: In progress. FT Minumum Price: 2.8 USD/kg"]
[null,"Coffee","Indonesia","in progress","Living Income Progress Report_V5 (fairtrade.at)","Coffee: In progress."]
[null,"Vanilla","Uganda","17,3 USD","https://files.fairtrade.net/publications/Fairtrade_Vanilla_LivingIncomeReferencePrice_explanatorynote.pdf","Vanila: 17,3 USD/kg"]
[null,"Coffee","Ethiopia","in progress",null,"Coffee: In progress."]
[null,"Vanila ","Madagascar","18.4 USD","https://files.fairtrade.net/publications/Fairtrade_Vanilla_LivingIncomeReferencePrice_explanatorynote.pdf","Vanila: 18.4 USD/kg"]
{"$rows_left_out":1}
{"sheet":"hide_Suchtabellen","index":13,"n_rows":42,"n_cols":49,"rows_kept":42,"cut":false,"hidden":true,"merged":[]}
[]
["Countries",null,"Region",null,"Commodity ",null,"Currency ",null,null,"Argentina","Bangladesh","Brazil","Burkina Faso","Cameroon","Chile","China","Colombia","Costa Rica","Cote d'Ivoire","Dominican Republic","Ecuador","Egypt, Arab Rep.","El Salvador","Ethiopia","Ghana","Guatemala","Honduras","India","Kenya","Madagascar","Malawi","Mexico","Morocco","Mozambique","Nicaragua","Nigeria","Pakistan","Panama","Papua New Guinea","Peru","Rwanda","South Africa","Sri Lanka","Tanzania","Tunisia","Turkey","Uganda","Vietnam","Other Country"]
["Argentina",null,"Urban",null,"Banana",null,"EUR",null,null,"Urban","Urban Satellite Cities and Districts Surrounding Dhaka","Urban Minas Gerais South/Southwestern Region","Rural","Rural","Non-Metropolitan Urban","Urban Zhengzhou","Urban-Rural Caribbean coast","Rural Limón and Heredia Provinces","Rural","Rural Northern Region","Rural Southern Coastal Region","Rural","Rural","Non-Metropolitan Urban Ziway Region","Peri-Urban Lower Volta Region","Rural Central Valley Area","Rural","Urban Tiruppur, Tamil Nadu","Rural Mount Kenya","Rural","Rural Southern Region","Non-metropolitan Urban & Rural Michoacán, northwestern regions","Rural","Rural","Urban Managua Free Trade Zone","Rural","Rural Sialkot","Rural","Rural","Rural","Rural","Rural Western Cape Province","Rural Estate Sector","Rural","Rural","Rural","Rural Lake Victoria Basin","Rural Economic Zone 4","Rural"]
["Bangladesh",null,"Rural",null,"Cocao",null,"LCU",null,null,"Rural","Urban Dhaka City","Non-metropolitan State of São Paulo, non-metropolitan areas",null,null,null,"Urban Chengdu",null,null,"Rural Cocoa growing areas",null,null,null,null,null,"Rural Cocoa growing areas of Ashanti, Central, Eastern, Western Regions",null,null,"Rural Bhadohi, Uttar Pradesh","Non-metropolitan Urban Lake Naivasha",null,null,null,null,null,"Rural-Urban Northwest",null,"Urban Sialkot",null,null,null,null,null,null,"Urban",null,null,null,"Urban Ho Chi Minh City","Urban"]
["Brazil",null,"Non-metropolitan",null,"Coffee",null,"USD",null,null,null,null,null,null,null,null,"Urban Hangzhou",null,null,null,null,null,null,null,null,null,null,null,"Rural Rural Nilgiris, Tamil Nadu",null,null,null,null,null,null,null,null,null,null,null,null,null,null,null,null,null,null,null,null,"Urban-Rural"]
["Burkina Faso",null,"Non-Metropolitan Urban",null,"Orange",null,null,null,null,null,null,null,null,null,null,"Urban Shanghai",null,null,null,null,null,null,null,null,null,null,null,null,null,null,null,null,null,null,null,null,null,null,null,null,null,null,null,null,null,null,null,null,"Non-metropolitan"]
["Cameroon",null,"Urban-Rural",null,"Palmoil",null,null,null,null,null,null,null,null,null,null,"Urban Shenzhen",null,null,null,null,null,null,null,null,null,null,null,null,null,null,null,null,null,null,null,null,null,null,null,null,null,null,null,null,null,null,null,null,"Peri-Urban"]
["Chile",null,"Peri-Urban",null,"Soy",null,null,null,null,null,null,null,null,null,null,"Urban Suzhou"]
{"$rows_left_out":34}